{"text_format":"1","workbook":"xlsx","n_sheets":4,"sheets":["Introducción","A","Resumen","C"],"not_rendered":{"charts":1,"images":6,"macros":1,"external_links":2,"defined_names":53,"comments":3,"pivot_tables":0},"unopened":[],"bounds":{"document_bytes":16777216,"sheet_cells":100000,"rows_first":2000,"rows_last":500,"rows_between":2000,"halvings":0,"cell_chars":16384,"cell_head_chars":4096},"cells_cut":0,"cells_raw":0,"read":"whole","date_system":"1900"}

{"sheet":"Introducción","index":0,"n_rows":138,"n_cols":2,"rows_kept":138,"cut":false,"hidden":false,"merged":[[33,1,34,1],[60,1,61,1],[63,1,64,1],[20,1,21,1],[22,1,23,1],[24,1,25,1],[26,1,27,1],[28,1,29,1],[30,1,31,1]]}
[]
[]
[]
[null,"Herramienta para Respuesta de los Cultivos a Nutrientes"]
[null,"(CNRT) v4.1"]
[null,"Planilla de cálculo para estimar la dosis óptima económica de aplicación de nutrientes"]
[]
[]
[null,"Traducción y adaptación al castellano"]
[null,"Ing. Agr. María M. Ron"]
[null,"Ing. Agr. Juan M. Martínez"]
[]
[null,"Ultima Revisión: 26/11/2012"]
[]
[]
{"$rows_left_out":124}
{"sheet":"A","index":1,"n_rows":32,"n_cols":11,"rows_kept":32,"cut":false,"hidden":false,"merged":[[0,0,0,3],[5,0,5,1],[4,0,4,1],[1,2,3,2],[1,3,3,3],[1,0,1,1],[3,0,3,1],[2,0,2,1]]}
["Herramienta para respuesta de cultivos a los nutrientes  (CNRT) v4.1",null,null,null,null,"Media ponderada por R2 ","Cuadrática (Q)","Cuadrática- Plateau (QP)","Mitscherlich (M)","Lineal- Plateau (LP)","Esférica- Plateau (SP)"]
["Paso 1: Ingresar datos de dosis y rendimientos.",null,"Dosis de nutriente  (kg/ha)","Rendimiento (kg/ha)","A:",null,2445.0852001512581,2435.7514861117083,3077.5282049202965,2428.0001266456306,2435.4098673580602]
["Paso 2: Ingresar datos del sitio, precios de los cultivos y de los fertilizantes",null,null,null,"B:",null,14.200970377105991,15.835478469829104,-650.64634837394533,13.90003003757398,610.90871199360879]
["Paso 3: Cliquear el botón \"Ajustar\" ",null,null,null,"C:",null,-7.7619134219724467E-2,-0.10105087480626736,-3.4869480558241843E-2,3038.9994704232167,66.038159426272884]
["Paso 4: Cliquear para agregar información a la hoja Resumen",null,0,2428,"R2:",null,{"$f":"IF(ISERROR(1-((SUM('C'!G5:G40)/COUNT('C'!G5:G40))/VAR($D5:$D40))),\"no data\",1-((SUM('C'!G5:G40)/COUNT('C'!G5:G40))/VAR($D5:$D40)))","v":0.99129431109580446},{"$f":"IF(ISERROR(1-((SUM('C'!H5:H40)/COUNT('C'!H5:H40))/VAR($D5:$D40))),\"no data\",1-((SUM('C'!H5:H40)/COUNT('C'!H5:H40))/VAR($D5:$D40)))","v":0.99116992255370795},{"$f":"IF(ISERROR(1-((SUM('C'!I5:I40)/COUNT('C'!I5:I40))/VAR($D5:$D40))),\"no data\",1-((SUM('C'!I5:I40)/COUNT('C'!I5:I40))/VAR($D5:$D40)))","v":0.99307651119922646},{"$f":"IF(ISERROR(1-((SUM('C'!J5:J40)/COUNT('C'!J5:J40))/VAR($D5:$D40))),\"no data\",1-((SUM('C'!J5:J40)/COUNT('C'!J5:J40))/VAR($D5:$D40)))","v":0.98603117840444288},{"$f":"IF(ISERROR(1-((SUM('C'!K5:K40)/COUNT('C'!K5:K40))/VAR($D5:$D40))),\"no data\",1-((SUM('C'!K5:K40)/COUNT('C'!K5:K40))/VAR($D5:$D40)))","v":0.98630885651142353}]
["DATOS DEL SITIO",null,30,2845,"DOE (kg/ha):",{"$f":"IF(AND(ISNUMBER(G5),ISNUMBER(B29),'C'!M49),(G6*G$5+H6*H$5+I6*I$5+J6*J$5+K6*K$5)/SUM(G$5:K$5),\"NA\")","v":37.853494780449218},{"$f":"IF(AND(ISNUMBER(G5),ISNUMBER(B29),'C'!M49),MIN((1+0.1*G5)*MAX($C5:$C40),IF(G4<0,MAX((G3-B29)/(-2*G4),0),IF(G3>B29,MAX($C5:$C40),0))),\"NA$\")","v":37.797619767070145},{"$f":"IF(AND(ISNUMBER(H5),ISNUMBER(B29),'C'!M49),MIN((1+0.1*H5)*MAX($C5:$C40),IF(H4<0,MAX((H3-B29)/(-2*H4),0),IF(H3>B29,MAX($C5:$C40),0))),\"NA$\")","v":37.12063428881109},{"$f":"IF(AND(ISNUMBER(I5),ISNUMBER(B29),'C'!M49),MIN((1+0.1*I5)*MAX($C5:$C40),MAX((1/I4)*LN(B29/(I3*I4)),0)),\"NA$\")","v":28.723094917674839},{"$f":"IF(AND(ISNUMBER(J5),ISNUMBER(B29),'C'!M49),MIN((1+0.1*J5)*MAX($C5:$C40),IF(J3>B29,(J4-J2)/J3,0)),\"NA$\")","v":43.956692332747352},{"$f":"IF(AND(ISNUMBER(K5),ISNUMBER(B29),'C'!M49),IF(ISNUMBER(SQRT(K4^2-2*B29*K4^3/(3*K3))),MIN((1+0.1*K5)*MAX($C5:$C40),SQRT(K4^2-2*B29*K4^3/(3*K3))),0),\"NA$\")","v":41.737694340651188}]
["Sitio","INTA Bordenave",60,2989,"Rendimiento @ DOE (kg/ha)",{"$f":"IF(ISNUMBER(F6),VLOOKUP(F6,'C'!B44:H294,7),\"NA\")","v":2887.2732304997776},{"$f":"IF(ISNUMBER(G6),G2+G3*G6+G4*G6^2,\"NA\")","v":2870.9567218326897},{"$f":"IF(ISNUMBER(H6),H2+H3*H6+H4*H6^2,\"NA\")","v":2884.3322981818551},{"$f":"IF(ISNUMBER(I6),I2+I3*EXP(I6*I4),\"NA\")","v":2838.5417560279957},{"$f":"IF(ISNUMBER(J6),IF(J3>'C'!O22,MIN(J4,J2+J3*J6),J2),\"NA\")","v":3038.9994704232167},{"$f":"IF(AND(ISNUMBER(K6),K6>0),IF(K6<A!K$4,A!K$2+A!K$3*(3*K6/(2*A!K$4)-0.5*(K6/A!K$4)^3),A!K$3+A!K$2),\"NA\")","v":2937.4568071497019}]
["Año","xxxxxx",90,3089,"Productividad Parcial del Factor (PPF)",{"$f":"IF(ISNUMBER(F7/F6),F7/F6,\"NA\")","v":76.274944948835014},75.956018911378919,77.701589788061654,98.824369872526887,69.136218153502611,70.378990827212803]
["Localidad","Bordenave",120,3039,"Efficiencia Agronómica (EAN)",{"$f":"IF(ISNUMBER(F12/F6),F12/F6,\"NA\")","v":11.968373864815783},{"$f":"IF(ISNUMBER((G7-G2)/G6),(G7-G2)/G6,\"NA\")","v":11.267151855219659},{"$f":"IF(ISNUMBER((H7-H2)/H6),(H7-H2)/H6,\"NA\")","v":12.084405901581215},{"$f":"IF(ISNUMBER((I7-(I2+I3))/I6),(I7-(I2+I3))/I6,\"NA\")","v":14.332017516271494},{"$f":"IF(ISNUMBER((J7-J2)/J6),(J7-J2)/J6,\"NA\")","v":13.90003003757398},{"$f":"IF(ISNUMBER((K7-K2)/K6),(K7-K2)/K6,\"NA\")","v":12.028621794344399}]
["Partido o Departamento","Puan",null,null,"Balance Parcial de Nutriente (BPN):",{"$f":"IF(AND(F6>0,ISNUMBER(F6)),F7*B30/(F6+B25),\"NA\")","v":1.5254988989767002},{"$f":"IF(AND(G6>0,ISNUMBER(G6)),G7*$B30/(G6+$B24),\"NA\")","v":1.5191203782275784},{"$f":"IF(AND(H6>0,ISNUMBER(H6)),H7*$B30/(H6+$B24),\"NA\")","v":1.5540317957612333},{"$f":"IF(AND(I6>0,ISNUMBER(I6)),I7*$B30/(I6+$B25),\"NA\")","v":1.9764873974505379},{"$f":"IF(AND(J6>0,ISNUMBER(J6)),J7*B30/(J6+B25),\"NA\")","v":1.3827243630700523},{"$f":"IF(AND(K6>0,ISNUMBER(K6)),K7*$B30/(K6+$B24),\"NA\")","v":1.4075798165442561}]
["Estado o Provincia","Buenos Aires",null,null,"Eficiencia de Recuperación (ERN)",{"$f":"IF(AND(F6>0,ISNUMBER(F6)),(F12/F6)*B30*(1/B31),\"NA\")","v":0.35726489148703827},{"$f":"IF(AND(G6>0,ISNUMBER(G6)),((G7-G2)*$B30*(1/$B31))/G6,\"NA\")","v":0.33633289120058679},{"$f":"IF(AND(H6>0,ISNUMBER(H6)),((H7-H2)*$B30*(1/$B31))/H6,\"NA\")","v":0.36072853437555868},{"$f":"IF(AND(I6>0,ISNUMBER(I6)),((I7-(I2+I3))*B30*(1/B31))/I6,\"NA\")","v":0.42782141839616394},{"$f":"IF(AND(J6>0,ISNUMBER(J6)),J3*B30*(1/B31),\"NA\")","v":0.41492626977832781},{"$f":"IF(AND(K6>0,ISNUMBER(K6)),((K7-K2)*$B30*(1/$B31))/K6,\"NA\")","v":0.35906333714460886}]
["Latitud",null,null,null,"Δ Rendimiento (kg/ha)",{"$f":"IF(ISNUMBER(F7),F7-VLOOKUP(0,'C'!B44:H294,7),\"NA\")","v":453.04477762226907},{"$f":"IF(ISNUMBER(G7),G7-G2,\"NA\")","v":425.87152168143166},{"$f":"IF(ISNUMBER(H7),H7-H2,\"NA\")","v":448.58081207014675},{"$f":"IF(ISNUMBER(I7),I7-(I2+I3),\"NA\")","v":411.65989948164452},{"$f":"IF(ISNUMBER(J7),J7-J2,\"NA\")","v":610.99934377758609},{"$f":"IF(ISNUMBER(K7),K7-K2,\"NA\")","v":502.04693979164176}]
["Longitud",null,null,null,"Rendimiento Relativo (%)",{"$f":"IF(ISNUMBER(F7),(F7-F12)/F7,\"NA\")","v":0.84308905273095736},{"$f":"IF(ISNUMBER(G7),G2/G7,\"NA\")","v":0.8516621590138167},{"$f":"IF(ISNUMBER(H7),H2/H7,\"NA\")","v":0.84447672261864193},{"$f":"IF(ISNUMBER(I7),(I2+I3)/I7,\"NA\")","v":0.85497486566564196},{"$f":"IF(ISNUMBER(J7),J2/J7,\"NA\")","v":0.79894720294488986},{"$f":"IF(ISNUMBER(K7),K2/K7,\"NA\")","v":0.82908789039223618}]
["Altitud",null,null,null,"Ganancia neta (kg/ha)",{"$f":"IF(ISNUMBER(F12),F12-(F6*$B$29),\"NA\")","v":137.59898778519221},{"$f":"IF(ISNUMBER(G12),G12-(G6*$B$29),\"NA\")","v":110.89135695584707},{"$f":"IF(ISNUMBER(H12),H12-(H6*$B$29),\"NA\")","v":139.24219299672097},172.3007751676875,244.6935743380248,154.23282028621514]
["Clase textural","Franco arenoso"]
{"$rows_left_out":18}
{"sheet":"Resumen","index":2,"n_rows":4,"n_cols":62,"rows_kept":4,"cut":false,"hidden":false,"merged":[[0,0,0,2],[0,4,1,5],[0,6,0,8]]}
["Resumen base de datos de múltiples años-sitios",null,null,{"$f":"COUNTA(A5:A957)","v":0},null,null,"El año-sitio actual se muestra en la fila 4- No borrar"]
[]
[{"$f":"A!A7","v":"Sitio"},{"$f":"A!A8","v":"Año"},{"$f":"A!A9","v":"Localidad"},{"$f":"A!A10","v":"Partido o Departamento"},{"$f":"A!A11","v":"Estado o Provincia"},{"$f":"A!A12","v":"Latitud"},{"$f":"A!A13","v":"Longitud"},{"$f":"A!A14","v":"Altitud"},{"$f":"A!A15","v":"Clase textural"},{"$f":"A!A16","v":"Cultivo antecesor"},{"$f":"A!A17","v":"Rendimiento esperado (kg/ha)"},{"$f":"A!A18","v":"Momento y forma de aplicación"},{"$f":"A!A19","v":"Sistema de labranza"},{"$f":"A!A20","v":"Grados-día del sitio"},{"$f":"A!A21","v":"Cultivo"},{"$f":"A!A22","v":"Cultivar"},{"$f":"A!A23","v":"N-nitratos (mg/kg)"},{"$f":"A!A24","v":"N de estiércol (kg/ha)"},{"$f":"A!A25","v":"Fecha de siembra"},{"$f":"A!A26","v":"Fecha de cosecha"},{"$f":"A!A27","v":"Precio Cultivo ($/kg)"},{"$f":"A!A28","v":"Costo Nutriente del fertilizante ($/kg)"},{"$f":"A!A29","v":"Relación de precios "},{"$f":"A!A30","v":"Contenido de N del cultivo (kg N/kg grano)"},{"$f":"A!A31","v":"Indice de cosecha de N"},{"$f":"A!A32","v":"Fuente fertilizante"},{"$f":"A!A33","v":0},{"$f":"A!A34","v":0},{"$f":"A!A35","v":0},{"$f":"A!A36","v":0},{"$f":"A!A37","v":0},{"$f":"A!A38","v":0},{"$f":"A!A39","v":0},{"$f":"A!A40","v":0},{"$f":"A!E6","v":"DOE (kg/ha):"},{"$f":"A!E7","v":"Rendimiento @ DOE (kg/ha)"},"PFP","AEN","PNB","REN",{"$f":"A!E12","v":"Δ Rendimiento (kg/ha)"},{"$f":"A!E13","v":"Rendimiento Relativo (%)"},"QA","QB","QC","QPA","QPB","QPC","MA","MB","MC","LPA","LPB","LPC","SA","SB","SC","QR2","QPR2","MR2","LPR2","SR2"]
[{"$f":"A!B7","v":"INTA Bordenave"},{"$f":"A!B8","v":"xxxxxx"},{"$f":"A!B9","v":"Bordenave"},{"$f":"A!B10","v":"Puan"},{"$f":"A!B11","v":"Buenos Aires"},{"$f":"A!B12","v":0},{"$f":"A!B13","v":0},{"$f":"A!B14","v":0},{"$f":"A!B15","v":"Franco arenoso"},{"$f":"A!B16","v":"Trigo"},{"$f":"A!B17","v":0},{"$f":"A!B18","v":"Preemergencia al voleo"},{"$f":"A!B19","v":"Labranza conservacionista"},{"$f":"A!B20","v":0},{"$f":"A!B21","v":"trigo"},{"$f":"A!B22","v":0},{"$f":"A!B23","v":0},{"$f":"A!B24","v":0},{"$f":"A!B25","v":0},{"$f":"A!B26","v":0},{"$f":"A!B27","v":120},{"$f":"A!B28","v":1000},{"$f":"A!B29","v":8.3333333333333339},{"$f":"A!B30","v":0.02},{"$f":"A!B31","v":0.67},{"$f":"A!B32","v":"Urea"},{"$f":"A!B33","v":0},{"$f":"A!B34","v":0},{"$f":"A!B35","v":0},{"$f":"A!B36","v":0},{"$f":"A!B37","v":0},{"$f":"A!B38","v":0},{"$f":"A!B39","v":0},{"$f":"A!B40","v":0},{"$f":"A!F6","v":37.853494780449218},{"$f":"A!F7","v":2887.2732304997776},{"$f":"A!F8","v":76.274944948835014},{"$f":"A!F9","v":11.968373864815783},{"$f":"A!F10","v":1.5254988989767002},{"$f":"A!F11","v":0.35726489148703827},{"$f":"A!F12","v":453.04477762226907},{"$f":"A!F13","v":0.84308905273095736},{"$f":"A!G2","v":2445.0852001512581},{"$f":"A!G3","v":14.200970377105991},{"$f":"A!G4","v":-7.7619134219724467E-2},{"$f":"A!H2","v":2435.7514861117083},{"$f":"A!H3","v":15.835478469829104},{"$f":"A!H4","v":-0.10105087480626736},{"$f":"A!I2","v":3077.5282049202965},{"$f":"A!I3","v":-650.64634837394533},{"$f":"A!I4","v":-3.4869480558241843E-2},{"$f":"A!J2","v":2428.0001266456306},{"$f":"A!J3","v":13.90003003757398},{"$f":"A!J4","v":3038.9994704232167},{"$f":"A!K2","v":2435.4098673580602},{"$f":"A!K3","v":610.90871199360879},{"$f":"A!K4","v":66.038159426272884},{"$f":"A!G5","v":0.99129431109580446},{"$f":"A!H5","v":0.99116992255370795},{"$f":"A!I5","v":0.99307651119922646},{"$f":"A!J5","v":0.98603117840444288},{"$f":"A!K5","v":0.98630885651142353}]

{"sheet":"C","index":3,"n_rows":294,"n_cols":25,"rows_kept":294,"cut":false,"hidden":false,"merged":[[2,1,2,5],[2,6,2,10],[13,18,13,22],[5,13,5,17],[5,18,5,22],[0,11,2,23]]}
["Hoja para cálculos - No ingresar datos aquí"]
[]
[null,"Valores predichos por la curva",null,null,null,null,"(Predicho menos observado)  al cuadrado"]
["Obs","Q","QP","M","LP","S ","Q","QP","M","LP","S ",null,"Información Técnica"]
[1,{"$f":"IF(ISNUMBER(A!C5),A!G$2+A!G$3*A!C5+A!G$4*A!C5^2,\"\")","v":2445.0852001512581},{"$f":"IF(ISNUMBER(A!C5),IF(A!C5<(A!H$3/(-2*A!H$4)),A!H$2+A!H$3*A!C5+A!H$4*A!C5^2,A!H$2+A!H$3*(A!H$3/(-2*A!H$4))+A!H$4*(A!H$3/(-2*A!H$4))^2),\"\")","v":2435.7514861117083},{"$f":"IF(ISNUMBER(A!C5),A!I$2+A!I$3*EXP(A!I$4*A!C5),\"\")","v":2426.8818565463512},{"$f":"IF(ISNUMBER(A!C5),IF((A!J$2+A!J$3*A!C5)<A!J$4,A!J$2+A!J$3*A!C5,A!J$4),\"\")","v":2428.0001266456306},{"$f":"IF(ISNUMBER(A!C5),IF(A!C5<A!K$4,A!K$2+A!K$3*(3*A!C5/(2*A!K$4)-0.5*(A!C5/A!K$4)^3),A!K$3+A!K$2),\"\")","v":2435.4098673580602},{"$f":"IF(ISNUMBER(A!$C5),(B5-A!$D5)^2,\"\")","v":291.90406420854811},{"$f":"IF(ISNUMBER(A!$C5),(C5-A!$D5)^2,\"\")","v":60.085536940007366},{"$f":"IF(ISNUMBER(A!$C5),(D5-A!$D5)^2,\"\")","v":1.2502447829377261},{"$f":"IF(ISNUMBER(A!$C5),(E5-A!$D5)^2,\"\")","v":1.6039115761192857E-8},{"$f":"IF(ISNUMBER(A!$C5),(F5-A!$D5)^2,\"\")","v":54.906134264045789},null,null,"Restricciones:"]
[{"$f":"A5+1","v":2},{"$f":"IF(ISNUMBER(A!C6),A!G$2+A!G$3*A!C6+A!G$4*A!C6^2,\"\")","v":2801.2570906666856},{"$f":"IF(ISNUMBER(A!C6),IF(A!C6<(A!H$3/(-2*A!H$4)),A!H$2+A!H$3*A!C6+A!H$4*A!C6^2,A!H$2+A!H$3*(A!H$3/(-2*A!H$4))+A!H$4*(A!H$3/(-2*A!H$4))^2),\"\")","v":2819.8700528809409},{"$f":"IF(ISNUMBER(A!C6),A!I$2+A!I$3*EXP(A!I$4*A!C6),\"\")","v":2848.9492162208171},{"$f":"IF(ISNUMBER(A!C6),IF((A!J$2+A!J$3*A!C6)<A!J$4,A!J$2+A!J$3*A!C6,A!J$4),\"\")","v":2845.0010277728502},{"$f":"IF(ISNUMBER(A!C6),IF(A!C6<A!K$4,A!K$2+A!K$3*(3*A!C6/(2*A!K$4)-0.5*(A!C6/A!K$4)^3),A!K$3+A!K$2),\"\")","v":2823.0610006618504},{"$f":"IF(ISNUMBER(A!$C6),(B6-A!$D6)^2,\"\")","v":1913.4421169425641},{"$f":"IF(ISNUMBER(A!$C6),(C6-A!$D6)^2,\"\")","v":631.51424220670799},{"$f":"IF(ISNUMBER(A!$C6),(D6-A!$D6)^2,\"\")","v":15.59630875876495},{"$f":"IF(ISNUMBER(A!$C6),(E6-A!$D6)^2,\"\")","v":1.0563170315944327E-6},{"$f":"IF(ISNUMBER(A!$C6),(F6-A!$D6)^2,\"\")","v":481.31969195933044},null,null,"Máximo",null,null,null,null,"Mínimo",null,null,null,null,"Tolerancia"]
[{"$f":"A6+1","v":3},{"$f":"IF(ISNUMBER(A!C7),A!G$2+A!G$3*A!C7+A!G$4*A!C7^2,\"\")","v":3017.7145395866096},{"$f":"IF(ISNUMBER(A!C7),IF(A!C7<(A!H$3/(-2*A!H$4)),A!H$2+A!H$3*A!C7+A!H$4*A!C7^2,A!H$2+A!H$3*(A!H$3/(-2*A!H$4))+A!H$4*(A!H$3/(-2*A!H$4))^2),\"\")","v":3022.0970449988922},{"$f":"IF(ISNUMBER(A!C7),A!I$2+A!I$3*EXP(A!I$4*A!C7),\"\")","v":2997.2259728314625},{"$f":"IF(ISNUMBER(A!C7),IF((A!J$2+A!J$3*A!C7)<A!J$4,A!J$2+A!J$3*A!C7,A!J$4),\"\")","v":3038.9994704232167},{"$f":"IF(ISNUMBER(A!C7),IF(A!C7<A!K$4,A!K$2+A!K$3*(3*A!C7/(2*A!K$4)-0.5*(A!C7/A!K$4)^3),A!K$3+A!K$2),\"\")","v":3038.8910493153958},{"$f":"IF(ISNUMBER(A!$C7),(B7-A!$D7)^2,\"\")","v":824.52478367096921},{"$f":"IF(ISNUMBER(A!$C7),(C7-A!$D7)^2,\"\")","v":1095.4143876586961},{"$f":"IF(ISNUMBER(A!$C7),(D7-A!$D7)^2,\"\")","v":67.666629023959402},{"$f":"IF(ISNUMBER(A!$C7),(E7-A!$D7)^2,\"\")","v":2499.9470426021253},{"$f":"IF(ISNUMBER(A!$C7),(F7-A!$D7)^2,\"\")","v":2489.1168017912532},null,null,"Q","QP","M","LP","S ","Q","QP","M","LP","S ","de ajuste"]
[4,{"$f":"IF(ISNUMBER(A!C8),A!G$2+A!G$3*A!C8+A!G$4*A!C8^2,\"\")","v":3094.4575469110287},{"$f":"IF(ISNUMBER(A!C8),IF(A!C8<(A!H$3/(-2*A!H$4)),A!H$2+A!H$3*A!C8+A!H$4*A!C8^2,A!H$2+A!H$3*(A!H$3/(-2*A!H$4))+A!H$4*(A!H$3/(-2*A!H$4))^2),\"\")","v":3056.137947013649},{"$f":"IF(ISNUMBER(A!C8),A!I$2+A!I$3*EXP(A!I$4*A!C8),\"\")","v":3049.3171759226711},{"$f":"IF(ISNUMBER(A!C8),IF((A!J$2+A!J$3*A!C8)<A!J$4,A!J$2+A!J$3*A!C8,A!J$4),\"\")","v":3038.9994704232167},{"$f":"IF(ISNUMBER(A!C8),IF(A!C8<A!K$4,A!K$2+A!K$3*(3*A!C8/(2*A!K$4)-0.5*(A!C8/A!K$4)^3),A!K$3+A!K$2),\"\")","v":3046.3185793516691},{"$f":"IF(ISNUMBER(A!$C8),(B8-A!$D8)^2,\"\")","v":29.784818286078444},{"$f":"IF(ISNUMBER(A!$C8),(C8-A!$D8)^2,\"\")","v":1079.9145264777437},{"$f":"IF(ISNUMBER(A!$C8),(D8-A!$D8)^2,\"\")","v":1574.7265267522312},{"$f":"IF(ISNUMBER(A!$C8),(E8-A!$D8)^2,\"\")","v":2500.0529579587783},{"$f":"IF(ISNUMBER(A!$C8),(F8-A!$D8)^2,\"\")","v":1821.7036685597684},null,"A",{"$f":"(1+X8)*MIN(A!D5:D40)","v":3156.4},{"$f":"N8","v":3156.4},{"$f":"(1+X8)*MAX(A!D5:D40)","v":4015.7000000000003},{"$f":"N8","v":3156.4},{"$f":"N8","v":3156.4},{"$f":"MAX((1-X8)*MIN(A!D5:D40)-(1+X8)*MIN(A!C5:C40)*(1/O20),0.5*MIN(A!D5:D40))","v":1699.6},{"$f":"S8","v":1699.6},{"$f":"(1-X8)*MAX(A!D5:D40)","v":2162.2999999999997},{"$f":"S8","v":1699.6},{"$f":"S8","v":1699.6},0.3]
[5,{"$f":"IF(ISNUMBER(A!C9),A!G$2+A!G$3*A!C9+A!G$4*A!C9^2,\"\")","v":3031.4861126399446},{"$f":"IF(ISNUMBER(A!C9),IF(A!C9<(A!H$3/(-2*A!H$4)),A!H$2+A!H$3*A!C9+A!H$4*A!C9^2,A!H$2+A!H$3*(A!H$3/(-2*A!H$4))+A!H$4*(A!H$3/(-2*A!H$4))^2),\"\")","v":3056.137947013649},{"$f":"IF(ISNUMBER(A!C9),A!I$2+A!I$3*EXP(A!I$4*A!C9),\"\")","v":3067.6173701103194},{"$f":"IF(ISNUMBER(A!C9),IF((A!J$2+A!J$3*A!C9)<A!J$4,A!J$2+A!J$3*A!C9,A!J$4),\"\")","v":3038.9994704232167},{"$f":"IF(ISNUMBER(A!C9),IF(A!C9<A!K$4,A!K$2+A!K$3*(3*A!C9/(2*A!K$4)-0.5*(A!C9/A!K$4)^3),A!K$3+A!K$2),\"\")","v":3046.3185793516691},{"$f":"IF(ISNUMBER(A!$C9),(B9-A!$D9)^2,\"\")","v":56.458503259599979},{"$f":"IF(ISNUMBER(A!$C9),(C9-A!$D9)^2,\"\")","v":293.70922784263911},{"$f":"IF(ISNUMBER(A!$C9),(D9-A!$D9)^2,\"\")","v":818.95387203100051},{"$f":"IF(ISNUMBER(A!$C9),(E9-A!$D9)^2,\"\")","v":2.8045156937322953E-7},{"$f":"IF(ISNUMBER(A!$C9),(F9-A!$D9)^2,\"\")","v":53.561603726677106},null,"B",{"$f":"O21*(1+X9)/O20","v":63.649999999999991},{"$f":"N9","v":63.649999999999991},{"$f":"MIN(-0.0000001,N8-U8)","v":-9.9999999999999995E-8},{"$f":"O21*(1+0.5*X9)/O20","v":48.575000000000003},{"$f":"-1*U9","v":1389.4},0,0,{"$f":"S8-Q10","v":-1389.4},{"$f":"S9","v":0},{"$f":"-1*P9","v":9.9999999999999995E-8},0.9]
[6,{"$f":"IF(ISNUMBER(A!C10),A!G$2+A!G$3*A!C10+A!G$4*A!C10^2,\"\")","v":""},{"$f":"IF(ISNUMBER(A!C10),IF(A!C10<(A!H$3/(-2*A!H$4)),A!H$2+A!H$3*A!C10+A!H$4*A!C10^2,A!H$2+A!H$3*(A!H$3/(-2*A!H$4))+A!H$4*(A!H$3/(-2*A!H$4))^2),\"\")","v":""},{"$f":"IF(ISNUMBER(A!C10),A!I$2+A!I$3*EXP(A!I$4*A!C10),\"\")","v":""},{"$f":"IF(ISNUMBER(A!C10),IF((A!J$2+A!J$3*A!C10)<A!J$4,A!J$2+A!J$3*A!C10,A!J$4),\"\")","v":""},{"$f":"IF(ISNUMBER(A!C10),IF(A!C10<A!K$4,A!K$2+A!K$3*(3*A!C10/(2*A!K$4)-0.5*(A!C10/A!K$4)^3),A!K$3+A!K$2),\"\")","v":""},{"$f":"IF(ISNUMBER(A!$C10),(B10-A!$D10)^2,\"\")","v":""},{"$f":"IF(ISNUMBER(A!$C10),(C10-A!$D10)^2,\"\")","v":""},{"$f":"IF(ISNUMBER(A!$C10),(D10-A!$D10)^2,\"\")","v":""},{"$f":"IF(ISNUMBER(A!$C10),(E10-A!$D10)^2,\"\")","v":""},{"$f":"IF(ISNUMBER(A!$C10),(F10-A!$D10)^2,\"\")","v":""},null,"C",-9.9999999999999995E-8,-9.9999999999999995E-8,-9.9999999999999995E-8,{"$f":"MAX(A!D5:D40)","v":3089},{"$f":"M44","v":120},-1,-1,{"$f":"(O21*(1+X10)/O20)/AVERAGE(P9,U9)","v":-6.268893046907377E-2},{"$f":"(1-(X8/2))*MAX(A!D5:D40)","v":2625.65},0,0.3]
[7,{"$f":"IF(ISNUMBER(A!C11),A!G$2+A!G$3*A!C11+A!G$4*A!C11^2,\"\")","v":""},{"$f":"IF(ISNUMBER(A!C11),IF(A!C11<(A!H$3/(-2*A!H$4)),A!H$2+A!H$3*A!C11+A!H$4*A!C11^2,A!H$2+A!H$3*(A!H$3/(-2*A!H$4))+A!H$4*(A!H$3/(-2*A!H$4))^2),\"\")","v":""},{"$f":"IF(ISNUMBER(A!C11),A!I$2+A!I$3*EXP(A!I$4*A!C11),\"\")","v":""},{"$f":"IF(ISNUMBER(A!C11),IF((A!J$2+A!J$3*A!C11)<A!J$4,A!J$2+A!J$3*A!C11,A!J$4),\"\")","v":""},{"$f":"IF(ISNUMBER(A!C11),IF(A!C11<A!K$4,A!K$2+A!K$3*(3*A!C11/(2*A!K$4)-0.5*(A!C11/A!K$4)^3),A!K$3+A!K$2),\"\")","v":""},{"$f":"IF(ISNUMBER(A!$C11),(B11-A!$D11)^2,\"\")","v":""},{"$f":"IF(ISNUMBER(A!$C11),(C11-A!$D11)^2,\"\")","v":""},{"$f":"IF(ISNUMBER(A!$C11),(D11-A!$D11)^2,\"\")","v":""},{"$f":"IF(ISNUMBER(A!$C11),(E11-A!$D11)^2,\"\")","v":""},{"$f":"IF(ISNUMBER(A!$C11),(F11-A!$D11)^2,\"\")","v":""}]
[8,{"$f":"IF(ISNUMBER(A!C12),A!G$2+A!G$3*A!C12+A!G$4*A!C12^2,\"\")","v":""},{"$f":"IF(ISNUMBER(A!C12),IF(A!C12<(A!H$3/(-2*A!H$4)),A!H$2+A!H$3*A!C12+A!H$4*A!C12^2,A!H$2+A!H$3*(A!H$3/(-2*A!H$4))+A!H$4*(A!H$3/(-2*A!H$4))^2),\"\")","v":""},{"$f":"IF(ISNUMBER(A!C12),A!I$2+A!I$3*EXP(A!I$4*A!C12),\"\")","v":""},{"$f":"IF(ISNUMBER(A!C12),IF((A!J$2+A!J$3*A!C12)<A!J$4,A!J$2+A!J$3*A!C12,A!J$4),\"\")","v":""},{"$f":"IF(ISNUMBER(A!C12),IF(A!C12<A!K$4,A!K$2+A!K$3*(3*A!C12/(2*A!K$4)-0.5*(A!C12/A!K$4)^3),A!K$3+A!K$2),\"\")","v":""},{"$f":"IF(ISNUMBER(A!$C12),(B12-A!$D12)^2,\"\")","v":""},{"$f":"IF(ISNUMBER(A!$C12),(C12-A!$D12)^2,\"\")","v":""},{"$f":"IF(ISNUMBER(A!$C12),(D12-A!$D12)^2,\"\")","v":""},{"$f":"IF(ISNUMBER(A!$C12),(E12-A!$D12)^2,\"\")","v":""},{"$f":"IF(ISNUMBER(A!$C12),(F12-A!$D12)^2,\"\")","v":""}]
[9,{"$f":"IF(ISNUMBER(A!C13),A!G$2+A!G$3*A!C13+A!G$4*A!C13^2,\"\")","v":""},{"$f":"IF(ISNUMBER(A!C13),IF(A!C13<(A!H$3/(-2*A!H$4)),A!H$2+A!H$3*A!C13+A!H$4*A!C13^2,A!H$2+A!H$3*(A!H$3/(-2*A!H$4))+A!H$4*(A!H$3/(-2*A!H$4))^2),\"\")","v":""},{"$f":"IF(ISNUMBER(A!C13),A!I$2+A!I$3*EXP(A!I$4*A!C13),\"\")","v":""},{"$f":"IF(ISNUMBER(A!C13),IF((A!J$2+A!J$3*A!C13)<A!J$4,A!J$2+A!J$3*A!C13,A!J$4),\"\")","v":""},{"$f":"IF(ISNUMBER(A!C13),IF(A!C13<A!K$4,A!K$2+A!K$3*(3*A!C13/(2*A!K$4)-0.5*(A!C13/A!K$4)^3),A!K$3+A!K$2),\"\")","v":""},{"$f":"IF(ISNUMBER(A!$C13),(B13-A!$D13)^2,\"\")","v":""},{"$f":"IF(ISNUMBER(A!$C13),(C13-A!$D13)^2,\"\")","v":""},{"$f":"IF(ISNUMBER(A!$C13),(D13-A!$D13)^2,\"\")","v":""},{"$f":"IF(ISNUMBER(A!$C13),(E13-A!$D13)^2,\"\")","v":""},{"$f":"IF(ISNUMBER(A!$C13),(F13-A!$D13)^2,\"\")","v":""},null,null,"Datos para los gráficos"]
[10,{"$f":"IF(ISNUMBER(A!C14),A!G$2+A!G$3*A!C14+A!G$4*A!C14^2,\"\")","v":""},{"$f":"IF(ISNUMBER(A!C14),IF(A!C14<(A!H$3/(-2*A!H$4)),A!H$2+A!H$3*A!C14+A!H$4*A!C14^2,A!H$2+A!H$3*(A!H$3/(-2*A!H$4))+A!H$4*(A!H$3/(-2*A!H$4))^2),\"\")","v":""},{"$f":"IF(ISNUMBER(A!C14),A!I$2+A!I$3*EXP(A!I$4*A!C14),\"\")","v":""},{"$f":"IF(ISNUMBER(A!C14),IF((A!J$2+A!J$3*A!C14)<A!J$4,A!J$2+A!J$3*A!C14,A!J$4),\"\")","v":""},{"$f":"IF(ISNUMBER(A!C14),IF(A!C14<A!K$4,A!K$2+A!K$3*(3*A!C14/(2*A!K$4)-0.5*(A!C14/A!K$4)^3),A!K$3+A!K$2),\"\")","v":""},{"$f":"IF(ISNUMBER(A!$C14),(B14-A!$D14)^2,\"\")","v":""},{"$f":"IF(ISNUMBER(A!$C14),(C14-A!$D14)^2,\"\")","v":""},{"$f":"IF(ISNUMBER(A!$C14),(D14-A!$D14)^2,\"\")","v":""},{"$f":"IF(ISNUMBER(A!$C14),(E14-A!$D14)^2,\"\")","v":""},{"$f":"IF(ISNUMBER(A!$C14),(F14-A!$D14)^2,\"\")","v":""},null,null,"Dosis óptima económica",null,null,null,null,"Rendimiento a la dosis óptima económica",null,null,null,null,"Media","Media"]
[11,{"$f":"IF(ISNUMBER(A!C15),A!G$2+A!G$3*A!C15+A!G$4*A!C15^2,\"\")","v":""},{"$f":"IF(ISNUMBER(A!C15),IF(A!C15<(A!H$3/(-2*A!H$4)),A!H$2+A!H$3*A!C15+A!H$4*A!C15^2,A!H$2+A!H$3*(A!H$3/(-2*A!H$4))+A!H$4*(A!H$3/(-2*A!H$4))^2),\"\")","v":""},{"$f":"IF(ISNUMBER(A!C15),A!I$2+A!I$3*EXP(A!I$4*A!C15),\"\")","v":""},{"$f":"IF(ISNUMBER(A!C15),IF((A!J$2+A!J$3*A!C15)<A!J$4,A!J$2+A!J$3*A!C15,A!J$4),\"\")","v":""},{"$f":"IF(ISNUMBER(A!C15),IF(A!C15<A!K$4,A!K$2+A!K$3*(3*A!C15/(2*A!K$4)-0.5*(A!C15/A!K$4)^3),A!K$3+A!K$2),\"\")","v":""},{"$f":"IF(ISNUMBER(A!$C15),(B15-A!$D15)^2,\"\")","v":""},{"$f":"IF(ISNUMBER(A!$C15),(C15-A!$D15)^2,\"\")","v":""},{"$f":"IF(ISNUMBER(A!$C15),(D15-A!$D15)^2,\"\")","v":""},{"$f":"IF(ISNUMBER(A!$C15),(E15-A!$D15)^2,\"\")","v":""},{"$f":"IF(ISNUMBER(A!$C15),(F15-A!$D15)^2,\"\")","v":""},null,null,"Q","QP","M","LP","S ","Q","QP","M","LP","S ","MERN","Y@mern"]
{"$rows_left_out":279}